{"text_format":"1","workbook":"xlsx","n_sheets":5,"sheets":["rev block","NPSH","NPIP SUCTION RESULTS","DISCHARGE RESULTS","Directions & Training"],"not_rendered":{"charts":0,"images":5,"macros":1,"external_links":0,"defined_names":2,"comments":2,"pivot_tables":0},"unopened":[],"bounds":{"document_bytes":16777216,"sheet_cells":100000,"rows_first":2000,"rows_last":500,"rows_between":2000,"halvings":0,"cell_chars":16384,"cell_head_chars":4096},"cells_cut":0,"cells_raw":0,"read":"whole","date_system":"1900"}

{"sheet":"rev block","index":0,"n_rows":9,"n_cols":8,"rows_kept":9,"cut":false,"hidden":false,"merged":[[2,3,2,4]]}
[]
[null,null,null,"MILTON ROY L.L.C.  PUMP SYSTEM ANALYSIS TOOL"]
[null,null,"Doc  No.: ",51518,null,"Rev #:","A"]
[]
[]
[null,null,"Revision History: "]
[]
[null,null,"Rev","Date","Brief description of change","Worksheets","Cells","Author"]
[null,null,"A","2013-06-30","Initial Release, added MBP & MCP,  ECN  #  16347 ","All","All","Glenn Smith"]

{"sheet":"NPSH","index":1,"n_rows":108,"n_cols":12,"rows_kept":108,"cut":false,"hidden":true,"merged":[]}
[null,null,null,null,"Pressure Drops at Peak Flow"]
[]
[]
["Pressure drop due to acceleration "]
[]
[null,"dP = [NQ(S.G.)Lp]/[2.77x10^4(Dp^2)]"]
[]
[null,"dP (Press Drop)",null,"N (SPM) ","Q (GPH)","S.G.","Lp (Pipe Length)","Dp (Pipe ID)","Atm. Press (psia)","Tank Level","Head Press. (PSIA)","Static PSI"]
[null,{"$f":"(D9*E9*F9*G9)/(27700*H9^2)","v":1.4763243003796742},null,{"$f":"'NPIP SUCTION RESULTS'!G42","v":45},{"$f":"'NPIP SUCTION RESULTS'!D42","v":50},{"$f":"'NPIP SUCTION RESULTS'!$G$26","v":1},{"$f":"'NPIP SUCTION RESULTS'!F56","v":20},{"$f":"'NPIP SUCTION RESULTS'!F55","v":1.0489999999999999},{"$f":"SUM(14.7,('NPIP SUCTION RESULTS'!$F$30*-0.3048*0.01450377/8))","v":14.7},{"$f":"'NPIP SUCTION RESULTS'!I32","v":0},{"$f":"(62.4/144)*F9*J9+I9+I12-J12","v":14.5549623},{"$f":"K9-I9-I12","v":-0.1450376999999996}]
[null,0,null,{"$f":"D9","v":45},{"$f":"E9","v":50},{"$f":"F9","v":1},0,{"$f":"'NPIP SUCTION RESULTS'!F55","v":1.0489999999999999}]
[null,0,null,{"$f":"D9","v":45},{"$f":"E9","v":50},{"$f":"F9","v":1},{"$f":"'NPIP SUCTION RESULTS'!H56","v":0},{"$f":"'NPIP SUCTION RESULTS'!H55","v":1.0489999999999999},"Tank Press (psig)","Vapor pressure","Elevation Loss"]
[null,0,null,{"$f":"D9","v":45},{"$f":"E9","v":50},{"$f":"F9","v":1},0,{"$f":"'NPIP SUCTION RESULTS'!H55","v":1.0489999999999999},{"$f":"'NPIP SUCTION RESULTS'!F28","v":0},{"$f":"'NPIP SUCTION RESULTS'!E26","v":0.14503769999999999},{"$f":"(62/144)*F9*J12+I9","v":14.7624467875}]
[null,0,null,{"$f":"D9","v":45},{"$f":"E9","v":50},{"$f":"F9","v":1},{"$f":"'NPIP SUCTION RESULTS'!J56","v":0},{"$f":"'NPIP SUCTION RESULTS'!J55","v":0.74199999999999999}]
[null,0,null,{"$f":"D9","v":45},{"$f":"E9","v":50},{"$f":"F9","v":1},0,{"$f":"'NPIP SUCTION RESULTS'!J55","v":0.74199999999999999}]
["Single Suction Check Valve Viscous Loss"]
[]
[null,"dP = 0.7(0.0000414U^0.9Q^1.1)/(Ds^3.1)"]
[]
[null,"dP (Press Drop)",null,"U (centipoise)","Q (GPH)","Number of Seats","Ds (Seat Dia.)",null,null,"Accel Losses","Frictional Losses"]
[null,{"$f":"0.7*(0.0000414)*(D20^0.9)*(E20^1.1)/(G20^3.1)*F20","v":0.10725744214520058},null,{"$f":"'NPIP SUCTION RESULTS'!H26","v":1},{"$f":"E9","v":50},{"$f":"'NPIP SUCTION RESULTS'!M42","v":1},{"$f":"INDEX('NPIP SUCTION RESULTS'!$AM$105:$AM$195,'NPIP SUCTION RESULTS'!$D$38)","v":0.28299999999999997},null,"Head (PSIA)",{"$f":"K9","v":14.5549623},{"$f":"K9","v":14.5549623}]
[null,null,null,".",null,null,null,null,"Acceleration",{"$f":"B9+B11+B13","v":1.4763243003796742},0]
[null,null,null,null,null,null,null,null,"Check Valve",0,{"$f":"B20","v":0.10725744214520058}]
["Contour Plate Viscous Loss - Non HPD pumps",null,null,null,null,null,null,null,"Contour Plate",0,{"$f":"$B$28","v":2.1854945148746762E-6}]
[null,null,null,null,null,null,null,null,"Friction",0,{"$f":"SUM(B35:B40)","v":1.1809569998641764E-2}]
[null,"dP = (0.00000434Q^1.1U^0.9)/(N^1.1Dh^3.1)",null,null,null,null,null,null,"Head Press (PSIA)",{"$f":"J20-J21-J22-J23","v":13.078637999620325},{"$f":"K20-K22-K23-K24","v":14.435893102361643}]
[]
[null,"dP (Press Drop)",null,"Q (GPH)","U (centipoise)","# of holes","Dh (hole dia.)"]
[null,{"$f":"(0.00000434*D28^1.1*E28^0.9)/(F28^1.1*G28^3.1)","v":2.1854945148746762E-6},null,{"$f":"E9","v":50},{"$f":"D20","v":1},{"$f":"INDEX('NPIP SUCTION RESULTS'!$BB$105:$BB$195,'NPIP SUCTION RESULTS'!$D$38)","v":1},{"$f":"INDEX('NPIP SUCTION RESULTS'!$BE$105:$BE$195,'NPIP SUCTION RESULTS'!$D$38)","v":5}]
[null,null,null,null,null,null,null,null,"k factor=",{"$f":"((4*(K24^2))+(J21^2))/(4*K24*J21)","v":31.260710043028052},"dosapro's method - don't use"]
["Pipeline Friction",null,null,null,null,null,null,null,"Total loss = ",{"$f":"J29*J21","v":46.150945883645242}]
[]
[null,"dP = (0.0000143QULp)/(Dp^4)",null,null,null,null,null,null,"sqrt sum squares",{"$f":"SQRT(J21^2+K24^2)","v":1.4763715338068151},"use this"]
[]
[null,"dP (Press Drop)",null,"Q (GPH)","U (centipoise)","Lp (Pipe Length)","Dp (Pipe ID)"]
[null,{"$f":"0.0000143*D35*E35*F35/G35^4","v":1.1809569998641764E-2},null,{"$f":"$D$28","v":50},{"$f":"$E$28","v":1},{"$f":"G9","v":20},1.0489999999999999]
[null,0,null,50,1,{"$f":"'NPIP SUCTION RESULTS'!$F$67","v":0},1.0489999999999999]
[null,0,null,50,1,0,1.0489999999999999]
[null,0,null,50,1,{"$f":"'NPIP SUCTION RESULTS'!$H$67","v":0},1.0489999999999999]
[null,0,null,50,1,{"$f":"G13","v":0},{"$f":"H13","v":0.74199999999999999}]
[null,0,null,50,1,{"$f":"'NPIP SUCTION RESULTS'!$J$67","v":0},{"$f":"H14","v":0.74199999999999999}]
[]
[]
[]
[]
[]
[]
[]
[]
[]
[]
[]
[]
[]
[]
[]
[]
[]
[]
[]
[]
{"$rows_left_out":49}
{"sheet":"NPIP SUCTION RESULTS","index":2,"n_rows":195,"n_cols":57,"rows_kept":195,"cut":false,"hidden":false,"merged":[[37,9,38,9],[37,10,38,13],[22,9,22,10],[24,4,24,5],[25,4,25,5],[24,7,24,8],[9,11,9,12],[103,53,103,55],[103,56,103,58],[103,42,103,44],[103,49,103,50],[103,33,103,36],[103,38,103,39],[103,40,103,41],[11,18,13,27],[103,51,103,52],[87,7,87,12],[82,7,82,12],[78,7,78,12],[81,7,81,12],[18,18,18,19],[67,24,67,26],[0,13,0,14],[3,1,3,14],[4,2,6,14],[0,11,0,12],[1,13,1,14],[0,1,1,8],[2,1,2,15],[9,5,9,6],[9,7,9,8],[9,9,9,10],[57,2,57,4],[58,2,58,4],[56,2,56,4],[49,2,49,14],[16,4,16,9],[16,11,16,14],[18,4,18,14],[25,13,25,14],[37,3,38,6],[40,6,40,7],[40,3,40,4],[40,9,40,10],[40,12,40,14],[96,1,96,14],[72,2,72,8],[72,9,72,10],[76,7,76,12],[77,7,77,12],[75,2,75,12],[86,1,86,6],[89,1,93,14],[87,1,87,6],[86,7,86,12],[79,7,79,12],[80,7,80,12],[70,2,70,4],[59,2,59,4],[60,2,60,4],[61,2,61,4],[62,2,62,4],[63,2,63,4],[66,2,66,4],[64,2,64,4],[67,2,67,4],[68,2,68,4],[69,2,69,4],[54,11,55,13],[52,2,52,4],[53,2,53,4],[22,2,22,3],[11,10,14,14],[54,2,54,4],[55,2,55,4],[22,11,22,14],[25,7,25,8],[24,10,24,11],[24,13,24,14],[25,10,25,11],[46,3,46,6],[51,2,51,4],[31,2,34,4],[22,4,22,8]]}
[null,null,null,null,null,null,null,null,null,null,null,"Document:",null,{"$f":"'rev block'!D3","v":51518}]
[null,null,null,null,null,null,null,null,null,null,null,null,"Revision:",{"$f":"'rev block'!G3","v":"A"}]
[null,"   PUMP SYSTEM ANALYSIS TOOL -SUCTION CONDITIONS"]
[null,"        Net Positive Inlet Pressure Calculator for 1 Tank to 1 Metering Pump "]
[null,null,"Calculations used in this program are based on a combination of theoritical anaylses and results of extensive fluids laboratory testing.  Because of simplifying assumptions made in equations, variations in chemical properties, variations in pipe characteristics, and other factors, Milton Roy L.L.C. cannot accept any responsibility for usefulness of calculated results.  The user is cautioned to verify results from this program with independent methods.  This calculator is applicable only for Milton Roy motor driven hydraulic or mechanical actuated diaphram or packed plunger pumps.   \nDO NOT USE THIS CALCULATOR  FOR ANY SOLENOID DRIVEN OR AIR-DRIVEN METERING PUMPS.   "]
[]
[]
[]
[null,"NOTES and COLOR KEY"]
[null,null,"▪","Cell Color Key:",null,"Required Data",null,"Optional Data",null,"Calculated Data",null,"Final Results Data"]
[null,null,"▪","All pressures are in psia as indicated"]
[null,null,"▪","All flow rates are in gallons per hour",null,null,null,null,null,null,"Note: Be sure all data from previous calculations has been cleared before starting each new calculation."]
[null,null,"▪","Lengths and height are in feet"]
[null,null,"▪","Pipe Diameters are in inches."]
[]
[null,"PROJECT DATA"]
[null,null,null,"Project Name:","NPSH CALC FOR  ??? PUMPS",null,null,null,null,null,"Date:",{"$f":"TODAY()","v":"2020-06-04"}]
[]
[null,null,null,"Prepared by: ","ENTER YOUR NAME"]
[]
[null,"CHEMICAL and SITE DATA"]
[]
[null,"1.","Select Chemical here:\n(based on 72° F)",null,68,null,null,null,null,"OR   Enter chemical     \nname here:  "]
[null,null,null,null,null,null,null,null,null,null,"Enter alternate values below based on  fluid temperature"]
[null,null,null,null,"Vapor Pressure psia:",null,"S.G.:","Viscosity cps:",null,null,"Vapor Pressure psia:",null,"S.G.:","Viscosity cps:"]
[null,null,null,null,{"$f":"IF($K$26>0,$K$26,INDEX($Z108:$Z178,$E$23)*14.50377)","v":0.14503769999999999},null,{"$f":"IF($M$26>0,$M$26,INDEX($Y108:$Y178,$E$23))","v":1},{"$f":"IF($N$26>0,$N$26,INDEX($AA108:$AA178,$E$23))","v":1}]
[]
[null,"2.","Enter tank or suction pressure:",null,null,0,"psig (enter \"0\" if atmospheric)"]
[]
[null,"3.","Enter elevation above sea level:",null,null,0,"feet"]
[]
[null,"4.","Enter the fluid height difference between tank outlet pipe elevation and pump centerline elevation\n(USE NEGATIVE NUMBER IF TANK OUTLET IS BELOW PUMP CENTERLINE):",null,null,null,null,"∆ H =",0,"feet"]
[null,null,null,null,null,null,null,"Fluid lift condtion",{"$f":"IF($I$32<0,\"X\",\"\")","v":""}]
[null,null,null,null,null,null,null,"Flooded suction",{"$f":"IF($I$32>=0,\"X\",\"\")","v":"X"}]
[]
[null,"5.    ENTER PUMP DATA"]
[null,null,null,"Select pump product:",null,null,null,null,null,"Number of Pump Heads: "]
[null,null,null,1,null,null,null,null,null,1,"IF SIMPLEX PUMP - ENTER 1, DUPLEX PUMP - ENTER 2, TRIPLEX PUMP - ENTER 3 \n (REMEMBER TO USE TOTAL FLOWRATE)"]
[]
[]
[null,null,null,"Total  pump flowrate:",null,null,"Pump stroke speed:",null,null,"Plunger diameter:",null,null,"Number of check valve seats:"]
[null,null,null,50,"GPH",null,45,"SPM",null,null,"inches",null,1,"  per head"]
[]
[null,null,null,"Minimum Allowable Inlet Pressure in liquid end for pump selected: ",null,null,null,null,null,null,{"$f":"INDEX($AL$105:$AL$195,$D$38)","v":3},"PSIA"]
[]
[null,null,"Note: The minimum allowable inlet pressure for each pump has a safety factor built in. Should you choose to add additional safety factor, "]
[null,null,null,"enter the amount of factor in psia here:",null,null,null,0,"  Be sure to enter 0 if no additional safety factor is required."]
[]
[null,"6.     ENTER SUCTION SIDE PIPING PARAMETERS"]
[null,null,"The calculator allows data to be entered for up to 3 different sections of suction pipe. This is important if pipe diameter changes between the tank and the pump. When not used or not applicable, enter \"0\" in the cell."]
[]
[null,null,"Description",null,null,"Section 1",null,"Section 2",null,"Section 3"]
[null,null,"Select Pipe Schedule:",null,null,1,null,1,null,2]
[null,null,"Select Pipe Size",null,null,5,null,5,null,4]
[null,null,"Calculated pipe ID inches",null,null,{"$f":"IF(F53=1,INDEX($U$108:$U$129,F54),IF(F53=2,INDEX($T$108:$T$129,F54),IF(F53=3,INDEX($V$108:$V$129,F54))))","v":1.0489999999999999},null,{"$f":"IF(H53=1,INDEX($U$108:$U$129,H54),IF(H53=2,INDEX($T$108:$T$129,H54),IF(H53=3,INDEX($V$108:$V$129,H54))))","v":1.0489999999999999},null,{"$f":"IF(J53=1,INDEX($U$108:$U$129,J54),IF(J53=2,INDEX($T$108:$T$129,J54),IF(J53=3,INDEX($V$108:$V$129,J54))))","v":0.74199999999999999},null,"Calculation Fields - do not change"]
[null,null,"Enter pipe actual length",null,null,20,"feet",0,"feet",0,"feet"]
[null,null,"# of 90°  elbows",null,null,0,null,0,null,0,null,{"$f":"SUM(30*F$55/12)*F57","v":0},{"$f":"SUM(30*H$55/12)*H57","v":0},{"$f":"SUM(30*J$55/12)*J57","v":0}]
[null,null,"# of 45°  elbows",null,null,0,null,0,null,0,null,{"$f":"SUM(16*F$55/12)*F58","v":0},{"$f":"SUM(16*H$55/12)*H58","v":0},{"$f":"SUM(16*J$55/12)*J58","v":0}]
[null,null,"Foot Valve",null,null,0,null,0,null,0,null,{"$f":"SUM(420*F$55/12)*F59","v":0},{"$f":"SUM(420*H$55/12)*H59","v":0},{"$f":"SUM(420*J$55/12)*J59","v":0}]
[null,null,"# of external ball check valves",null,null,0,null,0,null,0,null,{"$f":"SUM(150*F$55/12)*F60","v":0},{"$f":"SUM(150*H$55/12)*H60","v":0},{"$f":"SUM(150*J$55/12)*J60","v":0}]
{"$rows_left_out":136}
{"sheet":"DISCHARGE RESULTS","index":3,"n_rows":188,"n_cols":31,"rows_kept":188,"cut":false,"hidden":false,"merged":[[113,49,113,50],[113,51,113,53],[113,54,113,56],[92,16,92,26],[113,31,113,34],[113,36,113,37],[113,38,113,39],[113,40,113,42],[113,47,113,48],[77,2,77,6],[77,7,77,13],[81,1,81,14],[78,2,78,6],[78,7,78,13],[18,16,18,17],[38,1,39,14],[11,16,13,25],[2,1,2,14],[3,1,3,14],[16,3,16,8],[16,10,16,14],[7,21,7,25],[8,21,8,23],[22,4,22,7],[9,21,9,25],[8,5,8,6],[24,13,25,13],[27,2,27,10],[30,2,30,10],[25,6,25,7],[0,13,0,14],[18,3,18,14],[22,11,22,14],[22,8,22,10],[24,6,24,7],[24,9,25,10],[24,11,25,12],[5,1,6,14],[72,2,72,10],[70,2,70,10],[64,3,64,10],[61,2,61,6],[65,2,65,10],[67,2,67,10],[68,2,68,10],[69,2,69,10],[66,2,66,10],[61,7,61,8],[29,11,29,14],[50,2,50,4],[51,2,51,4],[71,2,71,10],[53,2,53,4],[55,2,55,4],[56,2,56,4],[57,2,57,4],[52,2,52,4],[46,2,46,4],[58,2,58,4],[59,2,59,4],[47,2,47,4],[48,2,48,4],[49,2,49,4],[73,2,73,10],[44,11,45,13],[10,10,13,14],[8,9,8,10],[8,11,8,12],[41,2,41,4],[42,2,42,4],[43,2,43,4],[44,2,44,4],[45,2,45,4],[8,7,8,8],[32,1,35,14],[24,3,24,4],[25,3,25,4],[23,9,23,13],[22,2,22,3]]}
[null,null,null,null,null,null,null,null,null,null,null,null,"Document: ",{"$f":"'NPIP SUCTION RESULTS'!$N$1","v":51518}]
[null,null,null,null,null,null,null,null,null,null,null,null,"Revision: ",{"$f":"'NPIP SUCTION RESULTS'!$N$2","v":"A"}]
[null,"PUMP SYSTEM ANALYSIS TOOL - DISCHARGE CONDITIONS"]
[null,"PUMP DISCHARGE TO INJECTION POINT PRESSURE LOSSES  CALCULATOR"]
[]
[null,"Calculations used in this program are based on a combination of theoritical anaylses and results of extensive fluids laboratory testing.  Because of simplifying assumptions made in equations, variations in chemical properties, variations in pipe characteristics, and other factors, Milton Roy L.L.C. cannot accept any responsibility for usefulness of calculated results.  The user is cautioned to verify results from this program with independent methods.  This calculator is applicable only for Milton Roy motor driven hydraulic or mechanical actuated diaphram or packed plunger pumps.   \nDO NOT USE THIS CALCULATOR  FOR ANY SOLENOID DRIVEN OR AIR-DRIVEN METERING PUMPS. "]
[]
[null,"NOTES and COLOR KEY"]
[null,null,"▪","Cell Color Key:",null,"Required Data",null,"Optional Data",null,"Calculated Data",null,"Final Results Data"]
[null,null,"▪","All pressures are in psia as indicated"]
[null,null,"▪","All flow rates are in gallons per hour",null,null,null,null,null,null,"Note: Be sure all data from previous calculations has been cleared before starting each new calculation."]
[null,null,"▪","Lengths and height are in feet"]
[null,null,"▪","Pipe Diameters are in inches."]
[]
[null,"PROJECT DATA"]
[]
[null,null,"Project Name:",{"$f":"'NPIP SUCTION RESULTS'!E17","v":"NPSH CALC FOR  ??? PUMPS"},null,null,null,null,null,"Date:",{"$f":"TODAY()","v":"2020-06-04"}]
[]
[null,null,"Prepared by: ",{"$f":"'NPIP SUCTION RESULTS'!E19","v":"ENTER YOUR NAME"}]
[]
[null,"CHEMICAL and SITE DATA"]
[]
[null,null,"Chemical selected on Suction Page:",null,65,null,null,null,"OR    chemical entered manually on suction page:",null,null,{"$f":"'NPIP SUCTION RESULTS'!$L$23","v":0}]
[]
[null,null,null,"Vapor Pressure psia:",null,"S.G.:","Viscosity cps.",null,null,"Elevation above sea level entered on Suction page:",null,{"$f":"'NPIP SUCTION RESULTS'!$F$30","v":0},null,"Feet"]
[null,null,null,{"$f":"'NPIP SUCTION RESULTS'!$E$26","v":0.14503769999999999},null,{"$f":"'NPIP SUCTION RESULTS'!$G$26","v":1},{"$f":"'NPIP SUCTION RESULTS'!$H$26","v":1}]
[]
[null,null,"1.     Enter net height difference from pump discharge elev.  to discharge injection  point elev. \n(UPWARD = POSITIVE,   DOWNWARD - NEGATIVE):",null,null,null,null,null,null,null,null,0,"Feet"]
[null,"PUMP DATA"]
[null,null,null,"Pump data from suction worksheet:",null,null,"Flow:\n(gph)",{"$f":"'NPIP SUCTION RESULTS'!$D$42","v":50},"Speed:\n (spm)",{"$f":"'NPIP SUCTION RESULTS'!$G$42","v":45},"Pump selected:",{"$f":"INDEX('NPIP SUCTION RESULTS'!AH105:AH195,'NPIP SUCTION RESULTS'!$D$38)","v":"Milroyal D HPD 1\" (MDH16_)"}]
[null,null,"2.    Enter maximum discharge pressure from pump: (obtain value from  flow/pressure tables from applicable Milton Roy pump brochure or data tables and backpressure valve setting)",null,null,null,null,null,null,null,null,150,"PSIG"]
[]
[null,"Did you know that:\n• Frictional and acceleration pressure losses also occur on the discharge side of the metering pump, which will affect pump performance at the discharge point.  \n• A discharge pulsation dampener (WHEN OPERATING PROPERLY) will significantly reduce acceleration losses in the discharge piping.\n• NPSH calculator determines pressure losses from each pump discharge to its injection point and will notify if there is sufficient pressure at the injection point.\n• Unlike centrifugal pumps, suction pressure (if adequate) will not affect discharge pressure in metering pumps.\n• Unlike centrifugal pumps, metering pump flowrate change is extremely minor due to discharge backpressure changes.\n• Just like the suction side; elbows, tees, flowmeters and valves affect friction losses, but not acceleration losses\n• Just like the suction side; pipe lengths, pipe diameters and flowrate affect both frictional and acceleration losses.\n• Discharge fluid flow siphoning may occur when lengthy discharge piping is open to atmospheric pressure and is arranged in a flat or down hill layout. Siphoning can occur even with a backpressure valve near the pump discharge. Siphoning will prevent the pump from proper metering. This happens because as a mass of process fluid builds up in discharge line, it will suddenly break free and pour out the open end, causing a momentary vacuum drag condition in the discharge piping, which in turn , causes excessive flow to pour past the pump ball checks. This situation can be avoided by installing a backpressure valve as close to the injection point as possible, which will keep most of the discharge pipe at a steady back\npressure.\n• Pressure gauges and switches should be sized so that their ranges are 25-50% above the max pressure rating of the pump, so that they will not be damaged if overpresurization occurs. For example, a 200 psig gauge should be used (if available) for a pump with max pressure rating of 150 psig.  "]
[]
[]
[]
[]
[null,"3.    ENTER DISCHARGE SIDE PIPING PARAMETERS:"]
[null,"The calculator allows data to be entered for up to 3 different sections of discharge pipe. This is important if pipe diameter changes between the pump and the injection point. When not used or not applicable, enter \"0\" in the cell."]
[]
[]
[null,null,"Description",null,null,"Section 1",null,"Section 2",null,"Section 3"]
[null,null,"Select Pipe Schedule:",null,null,2,null,2,null,2]
[null,null,"Select Pipe Size",null,null,3,null,3,null,3]
[null,null,"Calculated pipe ID inches",null,null,{"$f":"IF(F43=1,INDEX($S$118:$S$139,F44),IF(F43=2,INDEX($R$118:$R$139,F44),IF(F43=3,INDEX($T$118:$T$139,F44))))","v":0.54600000000000004},null,{"$f":"IF(H43=1,INDEX($S$118:$S$139,H44),IF(H43=2,INDEX($R$118:$R$139,H44),IF(H43=3,INDEX($T$118:$T$139,H44))))","v":0.54600000000000004},null,{"$f":"IF(J43=1,INDEX($S$118:$S$139,J44),IF(J43=2,INDEX($R$118:$R$139,J44),IF(J43=3,INDEX($T$118:$T$139,J44))))","v":0.54600000000000004},null,"Calculation Fields - CANNOT BE ALTERED"]
[null,null,"Enter pipe actual length",null,null,100,"feet",0,"feet",0,"feet"]
[null,null,"# of 90°  elbows",null,null,0,null,0,null,0,null,{"$f":"SUM(30*F$45/12)*F47","v":0},{"$f":"SUM(30*H$45/12)*H47","v":0},{"$f":"SUM(30*J$45/12)*J47","v":0}]
[null,null,"# of 45°  elbows",null,null,0,null,0,null,0,null,{"$f":"SUM(16*F$45/12)*F48","v":0},{"$f":"SUM(16*H$45/12)*H48","v":0},{"$f":"SUM(16*J$45/12)*J48","v":0}]
[null,null,"# of external ball check valves",null,null,0,null,0,null,0,null,{"$f":"SUM(150*F$45/12)*F49","v":0},{"$f":"SUM(150*H$45/12)*H49","v":0},{"$f":"SUM(150*J$45/12)*J49","v":0}]
[null,null,"# of tees - run flow",null,null,0,null,0,null,0,null,{"$f":"SUM(20*F$45/12)*F50","v":0},{"$f":"SUM(20*H$45/12)*H50","v":0},{"$f":"SUM(20*J$45/12)*J50","v":0}]
[null,null,"# of tees - branch flow",null,null,0,null,0,null,0,null,{"$f":"SUM(60*F$45/12)*F51","v":0},{"$f":"SUM(60*H$45/12)*H51","v":0},{"$f":"SUM(60*J$45/12)*J51","v":0}]
[null,null,"# of single reduction reducer bushings",null,null,0,null,0,null,0,null,{"$f":"SUM(15.5*F$45/12)*F52","v":0},{"$f":"SUM(15.5*H$45/12)*H52","v":0},{"$f":"SUM(15.5*J$45/12)*J52","v":0}]
[null,null,"# of manual Valves",null,null,0,null,0,null,0,null,{"$f":"SUM((('NPIP SUCTION RESULTS'!$D$42/60)*27700*(F$45^2))/((F$54^2)*'NPIP SUCTION RESULTS'!$G$42*$F$26)*F$53)","v":0},{"$f":"SUM((('NPIP SUCTION RESULTS'!$D$42/60)*27700*(H$45^2))/((H$54^2)*'NPIP SUCTION RESULTS'!$G$42*$F$26)*H$53)","v":0},{"$f":"SUM((('NPIP SUCTION RESULTS'!$D$42/60)*27700*(J$45^2))/((J$54^2)*'NPIP SUCTION RESULTS'!$G$42*$F$26)*J$53)","v":0}]
[null,null,"CV of manual  Valve above",null,null,9,null,9,null,9]
[]
[null,null,"Calculated equivalent pipe length",null,null,{"$f":"SUM(L46:L54)","v":0},"feet",{"$f":"SUM(M46:M54)","v":0},"feet",{"$f":"SUM(N46:N54)","v":0},"feet"]
[null,null,"Friction pressure drop for section without dampener",null,null,{"$f":"(0.0000143*'NPIP SUCTION RESULTS'!$D$42*'NPIP SUCTION RESULTS'!$H$26*F46/F45^4)+(0.0000143*'NPIP SUCTION RESULTS'!$D$42*'NPIP SUCTION RESULTS'!$H$26*F56/F45^4)","v":0.80451745479548642},"psi",{"$f":"(0.0000143*'NPIP SUCTION RESULTS'!$D$42*'NPIP SUCTION RESULTS'!$H$26*H46/H45^4)+(0.0000143*'NPIP SUCTION RESULTS'!$D$42*'NPIP SUCTION RESULTS'!$H$26*H56/H45^4)","v":0},"psi",{"$f":"(0.0000143*'NPIP SUCTION RESULTS'!$D$42*'NPIP SUCTION RESULTS'!$H$26*J46/J45^4)+(0.0000143*'NPIP SUCTION RESULTS'!$D$42*'NPIP SUCTION RESULTS'!$H$26*J56/J45^4)","v":0},"psi"]
[null,null,"Acceleration Pressure Drop for pipe section (without dampener):",null,null,{"$f":"('NPIP SUCTION RESULTS'!$G$42*'NPIP SUCTION RESULTS'!$D$42*'NPIP SUCTION RESULTS'!$G$26*F46)/(27700*F45^2)*$AD$186","v":27.246922950497353},"psi",{"$f":"('NPIP SUCTION RESULTS'!$G$42*'NPIP SUCTION RESULTS'!$D$42*'NPIP SUCTION RESULTS'!$G$26*H46)/(27700*H45^2)*$AD$186","v":0},"psi",{"$f":"('NPIP SUCTION RESULTS'!$G$42*'NPIP SUCTION RESULTS'!$D$42*'NPIP SUCTION RESULTS'!$G$26*J46)/(27700*J45^2)*$AD$186","v":0},"psi"]
[null,null,"Friction pressure drop for pipe section (with dampener):",null,null,{"$f":"SUM(F57*0.2)","v":0.16090349095909728},"psi",{"$f":"SUM(H57*0.2)","v":0},"psi",{"$f":"SUM(J57*0.2)","v":0},"psi"]
[null,null,"Acceleration Pressure Drop for pipe section (with dampener):",null,null,{"$f":"SUM(F58*0.2)*$AD$186","v":5.4493845900994708},"psi",{"$f":"SUM(H58*0.2)*$AD$186","v":0},"psi",{"$f":"SUM(J58*0.2)*$AD$186","v":0},"psi"]
{"$rows_left_out":129}
{"sheet":"Directions & Training","index":4,"n_rows":23,"n_cols":4,"rows_kept":23,"cut":false,"hidden":false,"merged":[]}
[]
[null,"DOUBLE CLICK ON THE BOX BELOW FOR STEP BY STEP  INSTRUCTIONS ON HOW TO USE THE  PUMPING SYSTEMS ANALYSIS TOOL",null,"DOUBLE CLICK ON THE BOX BELOW FOR NPSH TRAINING SLIDE SHOW"]
[null,"   V    V     V     V     V     V     V     V     V     V     V     V     V     V     V     V    ",null,"     V    V     V     V     V     V     V     V     V     V     V     V     V     V     V     V     V"]
[]
[]
[]
[]
[]
[]
[]
[]
[]
[]
[]
[]
[]
[]
[]
[]
[]
[]
[]
[null,"PRESS <ESC> KEY TO EXIT SLIDE SHOW",null,"PRESS <ESC> KEY TO EXIT SLIDE SHOW"]